BDBM284910 (S)-4-acetyl-1-(5-(4-amino-5-(1- methyl-1H-pyrazol-4-yl)pyrrolo[2,1-f] [1,2,4]triazin-7-yl)pyridin-3-yl)-3,3,6- trimethylpiperazin-2-one::US10023576, Example 102
SMILES C[C@H]1CN(C(C)=O)C(C)(C)C(=O)N1c1cncc(c1)-c1cc(-c2cnn(C)c2)c2c(N)ncnn12
InChI Key InChIKey=KYUIFIXZWJDXJJ-AWEZNQCLSA-N
Data  1 IC50
  Tab Delimited (TSV)   2D SDfile   Computed 3D by Vconf -m prep SDfile
Find this compound or compounds like it in BindingDB:
Activity Spreadsheet -- Enzyme Inhibition Constant Data from BindingDB
Found 1 hit for monomerid = 284910
TargetPhosphatidylinositol 4,5-bisphosphate 3-kinase catalytic subunit delta isoform(Homo sapiens (Human))
Bristol-Myers Squibb
US Patent
LigandPNGBDBM284910((S)-4-acetyl-1-(5-(4-amino-5-(1- methyl-1H-pyrazol...)
Affinity DataIC50:  1nMpH: 7.5 T: 2°C. Assay description: The ADP-Glo format PI3K assays were performed in Proxiplate 384-well plates (Perkin Elmer #6008280). The final assay volume was 2 μl prepared fr...
Ligand InfoPC cidPC sid
In DepthDetails US Patent