BDBM284951 US10023583, Example 23
SMILES N[C@@H](CSCCC1CC1)[C@](O)(Cc1nccc2oc(CCC3CC3)cc12)C(O)=O
InChI Key InChIKey=XFJWGXZZGDJCIZ-RBBKRZOGSA-N
Data  2 IC50
  Tab Delimited (TSV)   2D SDfile   Computed 3D by Vconf -m prep SDfile
Find this compound or compounds like it in BindingDB:
Activity Spreadsheet -- Enzyme Inhibition Constant Data from BindingDB
Found 2 hits for monomerid = 284951
TargetLeucyl-cystinyl aminopeptidase(Homo sapiens (Human))
Astellas Pharma
US Patent
LigandPNGBDBM284951(US10023583, Example 23)
Affinity DataIC50:  4.90nM. Assay description: HEK293 cells forced to transiently express hP-LAP (J Biol Chem 1996; 271: 56-61) were prepared by lipofection, homogenized, and then subjected to ult...
Ligand InfoPC cidPC sid
In DepthDetails US Patent
TargetLeucyl-cystinyl aminopeptidase(Rattus norvegicus)
Astellas Pharma
US Patent
LigandPNGBDBM284951(US10023583, Example 23)
Affinity DataIC50:  4.60nM. Assay description: Rat epididymal fat pads were homogenized and subjected to ultracentrifugation at 100,000×g for 30 minutes to obtain microsomes containing IRAP. The m...
Ligand InfoPC cidPC sid
In DepthDetails US Patent