BDBM284979 4-(5-amino-2,4-difluorophenyl)-2- methylisoquinolin-1-one::US10023592, Example 24::US10941160, Example 24
SMILES Cn1cc(-c2cc(N)c(F)cc2F)c2ccccc2c1=O
InChI Key InChIKey=VOHNHOQQPKUIRO-UHFFFAOYSA-N
Data  2 IC50
  Tab Delimited (TSV)   2D SDfile   Computed 3D by Vconf -m prep SDfile
Find this compound or compounds like it in BindingDB:
Activity Spreadsheet -- Enzyme Inhibition Constant Data from BindingDB
Found 2 hits for monomerid = 284979
TargetBromodomain-containing protein 4(Homo sapiens (Human))
Celgene Quanticel Research
US Patent
LigandPNGBDBM284979(4-(5-amino-2,4-difluorophenyl)-2- methylisoquinoli...)
Affinity DataIC50:  2.75E+3nM. Assay description: Determination of the IC50 for the heterocyclic derivative BRD4 inhibitors disclosed herein was performed as follows. His-tagged BRD4 was cloned, expr...
Ligand InfoPC cidPC sid
In DepthDetails US Patent
TargetBromodomain-containing protein 4(Homo sapiens (Human))
Celgene Quanticel Research
US Patent
LigandPNGBDBM284979(4-(5-amino-2,4-difluorophenyl)-2- methylisoquinoli...)
Affinity DataIC50:  2.75E+3nMpH: 7.3Assay Description:Determination of the IC50 for the heterocyclic derivative BRD4 inhibitors disclosed herein was performed as follows. His-tagged BRD4 was cloned, expr...
Ligand InfoPC cidPC sid
In DepthDetails US Patent