BDBM285296 2-methyl-4-(3-methylsulfonyl-5- phenylmethoxyphenyl)isoquinolin-1-one::BDBM486140::US10023592, Example 344
SMILES Cn1cc(-c2cc(OCc3ccccc3)cc(c2)S(C)(=O)=O)c2ccccc2c1=O
InChI Key InChIKey=FKWDUYPFNXYDTJ-UHFFFAOYSA-N
Data  2 IC50
  Tab Delimited (TSV)   2D SDfile   Computed 3D by Vconf -m prep SDfile
Find this compound or compounds like it in BindingDB:
Activity Spreadsheet -- Enzyme Inhibition Constant Data from BindingDB
Found 2 hits for monomerid = 285296
TargetBromodomain-containing protein 4(Homo sapiens (Human))
Celgene Quanticel Research
US Patent
LigandPNGBDBM285296(2-methyl-4-(3-methylsulfonyl-5- phenylmethoxypheny...)
Affinity DataIC50: <500nM. Assay description: Determination of the IC50 for the heterocyclic derivative BRD4 inhibitors disclosed herein was performed as follows. His-tagged BRD4 was cloned, expr...
Ligand InfoPC cidPC sid
In DepthDetails US Patent
TargetBromodomain-containing protein 4(Homo sapiens (Human))
Celgene Quanticel Research
US Patent
LigandPNGBDBM285296(2-methyl-4-(3-methylsulfonyl-5- phenylmethoxypheny...)
Affinity DataIC50: <500nMpH: 7.3Assay Description:Determination of the IC50 for the heterocyclic derivative BRD4 inhibitors disclosed herein was performed as follows. His-tagged BRD4 was cloned, expr...
Ligand InfoPC cidPC sid
In DepthDetails US Patent