BDBM285541 3-(5-chloropyridin-3-yl)-N-cyclopropylimidazo[1,2-b]pyridazine-2-carboxamide::US10077269, Example 14::US10669279, Example 14::US9598421, Example 14
SMILES Clc1cncc(c1)-c1c(nc2cccnn12)C(=O)NC1CC1
InChI Key InChIKey=BAWGMUZVOXOKPF-UHFFFAOYSA-N
Data  12 IC50
  Tab Delimited (TSV)   2D SDfile   Computed 3D by Vconf -m prep SDfile
Find this compound or compounds like it in BindingDB:
Activity Spreadsheet -- Enzyme Inhibition Constant Data from BindingDB
Found 12 hits for monomerid = 285541
TargetIsoform 4 of cAMP-specific 3',5'-cyclic phosphodiesterase 4A (RD1)(Homo sapiens (Human))
Pfizer
US Patent
LigandPNGBDBM285541(3-(5-chloropyridin-3-yl)-N-cyclopropylimidazo[1,2-...)
Affinity DataIC50:  73.7nM. Assay description: The PDE4A3, PDE4B1, PDE4C1 and PDE4D3 assays use the Scintillation Proximity Assay (SPA) technology to measure the inhibition of human recombinant PD...
Ligand InfoPC cidPC sid
In DepthDetails US Patent
TargetcAMP-specific 3',5'-cyclic phosphodiesterase 4B [122-736,S654A](Homo sapiens (Human))
Pfizer
US Patent
LigandPNGBDBM285541(3-(5-chloropyridin-3-yl)-N-cyclopropylimidazo[1,2-...)
Affinity DataIC50:  79.1nM. Assay description: The PDE4A3, PDE4B1, PDE4C1 and PDE4D3 assays use the Scintillation Proximity Assay (SPA) technology to measure the inhibition of human recombinant PD...
Ligand InfoPC cidPC sid
In DepthDetails US Patent
LigandPNGBDBM285541(3-(5-chloropyridin-3-yl)-N-cyclopropylimidazo[1,2-...)
Affinity DataIC50:  108nM. Assay description: The PDE4A3, PDE4B1, PDE4C1 and PDE4D3 assays use the Scintillation Proximity Assay (SPA) technology to measure the inhibition of human recombinant PD...
Ligand InfoPC cidPC sid
In DepthDetails US Patent
LigandPNGBDBM285541(3-(5-chloropyridin-3-yl)-N-cyclopropylimidazo[1,2-...)
Affinity DataIC50: >8.01E+3nM. Assay description: The PDE4A3, PDE4B1, PDE4C1 and PDE4D3 assays use the Scintillation Proximity Assay (SPA) technology to measure the inhibition of human recombinant PD...
Ligand InfoPC cidPC sid
In DepthDetails US Patent
TargetcAMP-specific 3',5'-cyclic phosphodiesterase 4A(Homo sapiens (Human))
Pfizer
US Patent
LigandPNGBDBM285541(3-(5-chloropyridin-3-yl)-N-cyclopropylimidazo[1,2-...)
Affinity DataIC50:  73.7nM. Assay description: The PDE4A3, PDE4B1, PDE4C1 and PDE4D3 assays use the Scintillation Proximity Assay (SPA) technology to measure the inhibition of human recombinant PD...
Ligand InfoPC cidPC sid
In DepthDetails US Patent
TargetcAMP-specific 3',5'-cyclic phosphodiesterase 4D(Homo sapiens (Human))
Pfizer
US Patent
LigandPNGBDBM285541(3-(5-chloropyridin-3-yl)-N-cyclopropylimidazo[1,2-...)
Affinity DataIC50: >8.01E+3nM. Assay description: Human PDE4A3 coding sequence (amino acids 2 to 825 from the sequence with accession number NP_001104779) was cloned into the baculovirus expression v...
Ligand InfoPC cidPC sid
In DepthDetails US Patent
TargetcAMP-specific 3',5'-cyclic phosphodiesterase 4C(Homo sapiens (Human))
Pfizer
US Patent
LigandPNGBDBM285541(3-(5-chloropyridin-3-yl)-N-cyclopropylimidazo[1,2-...)
Affinity DataIC50:  108nM
Ligand InfoPC cidPC sid
In DepthDetails US Patent
TargetcAMP-specific 3',5'-cyclic phosphodiesterase 4D(Homo sapiens (Human))
Pfizer
US Patent
LigandPNGBDBM285541(3-(5-chloropyridin-3-yl)-N-cyclopropylimidazo[1,2-...)
Affinity DataIC50: >8.01E+3nM
Ligand InfoPC cidPC sid
In DepthDetails US Patent
TargetcAMP-specific 3',5'-cyclic phosphodiesterase 4A(Homo sapiens (Human))
Pfizer
US Patent
LigandPNGBDBM285541(3-(5-chloropyridin-3-yl)-N-cyclopropylimidazo[1,2-...)
Affinity DataIC50:  73.7nM. Assay description: Human PDE4A3 coding sequence (amino acids 2 to 825 from the sequence with accession number NP_001104779) was cloned into the baculovirus expression v...
Ligand InfoPC cidPC sid
In DepthDetails US Patent
TargetcAMP-specific 3',5'-cyclic phosphodiesterase 4B(Homo sapiens (Human))
Pfizer
US Patent
LigandPNGBDBM285541(3-(5-chloropyridin-3-yl)-N-cyclopropylimidazo[1,2-...)
Affinity DataIC50:  79.1nM. Assay description: Human PDE4A3 coding sequence (amino acids 2 to 825 from the sequence with accession number NP_001104779) was cloned into the baculovirus expression v...
Ligand InfoPC cidPC sid
In DepthDetails US Patent
TargetcAMP-specific 3',5'-cyclic phosphodiesterase 4C(Homo sapiens (Human))
Pfizer
US Patent
LigandPNGBDBM285541(3-(5-chloropyridin-3-yl)-N-cyclopropylimidazo[1,2-...)
Affinity DataIC50:  108nM. Assay description: Human PDE4A3 coding sequence (amino acids 2 to 825 from the sequence with accession number NP_001104779) was cloned into the baculovirus expression v...
Ligand InfoPC cidPC sid
In DepthDetails US Patent
TargetcAMP-specific 3',5'-cyclic phosphodiesterase 4B(Homo sapiens (Human))
Pfizer
US Patent
LigandPNGBDBM285541(3-(5-chloropyridin-3-yl)-N-cyclopropylimidazo[1,2-...)
Affinity DataIC50:  79.1nM
Ligand InfoPC cidPC sid
In DepthDetails US Patent