BDBM28557 N-cyclopentyl-12-methyl-8-(methylamino)-5-thia-3,7,10,12-tetraazatricyclo[7.3.0.0^{2,6}]dodeca-1(9),2(6),3,7,10-pentaene-4-carboxamide::thiazole-based tricyclic inhibitor, 30c
SMILES CNc1nc2sc(nc2c2n(C)cnc12)C(=O)NC1CCCC1
InChI Key InChIKey=JTGGXKLNOOTJHT-UHFFFAOYSA-N
Data  1 IC50
  Tab Delimited (TSV)   2D SDfile   Computed 3D by Vconf -m prep SDfile
Find this compound or compounds like it in BindingDB:
Activity Spreadsheet -- Enzyme Inhibition Constant Data from BindingDB
Found 1 hit for monomerid = 28557
TargetInhibitor of nuclear factor kappa-B kinase subunit beta(Homo sapiens (Human))
Bristol-Myers Squibb
LigandPNGBDBM28557(N-cyclopentyl-12-methyl-8-(methylamino)-5-thia-3,7...)
Affinity DataIC50:  160nMpH: 7.5 T: 2°C. Assay description: Assays measuring the enzyme catalyzed phosphorylation of GST-I-kappa-B-alpha were performed by adding enzyme at room temperature to substrate solutio...
In DepthDetails ArticlePubMed