BDBM285646 5-[4-(1H-imidazo[4,5-c]pyridin-4-yloxy)-2-methylphenyl]-6-methylpyrimidine-4-carbonitrile::US10077272, Example 12::US9868744, 12
SMILES Cc1cc(Oc2nccc3[nH]cnc23)ccc1-c1c(C)ncnc1C#N
InChI Key InChIKey=UMAZSPWKQMTIHK-UHFFFAOYSA-N
Data  2 KI
  Tab Delimited (TSV)   2D SDfile   Computed 3D by Vconf -m prep SDfile
Find this compound or compounds like it in BindingDB:
Activity Spreadsheet -- Enzyme Inhibition Constant Data from BindingDB
Found 2 hits for monomerid = 285646
TargetD(1A) dopamine receptor(Homo sapiens (Human))
Pfizer
US Patent
LigandPNGBDBM285646(5-[4-(1H-imidazo[4,5-c]pyridin-4-yloxy)-2-methylph...)
Affinity DataKi:  367nM. Assay description: D1 binding assays were performed using over-expressing LTK human cell lines. To determine basic assay parameters, ligand concentrations were determin...
Ligand InfoPC cidPC sid
In DepthDetails US Patent
TargetD(1A) dopamine receptor(Homo sapiens (Human))
Pfizer
US Patent
LigandPNGBDBM285646(5-[4-(1H-imidazo[4,5-c]pyridin-4-yloxy)-2-methylph...)
Affinity DataKi:  367nMpH: 7.4Assay Description:D1 binding assays were performed using over-expressing LTK human cell lines. To determine basic assay parameters, ligand concentrations were determin...
Ligand InfoPC cidPC sid
In DepthDetails US Patent