BDBM285663 US10077273, Compound 11::US10584132, Compound 11::US10934305, Compound 11
SMILES CC(C)C1(c2c(C)n[nH]c2OC(N)=C1C#N)c1cc(cc(c1)C(F)(F)F)C#CCCC(N)=O
InChI Key
Data  6 IC50
  Tab Delimited (TSV)   2D SDfile   Computed 3D by Vconf -m prep SDfile
Find this compound or compounds like it in BindingDB:
Activity Spreadsheet -- Enzyme Inhibition Constant Data from BindingDB
Found 6 hits for monomerid = 285663
TargetSerine hydroxymethyltransferase, mitochondrial(Homo sapiens (Human))
The Trustees Of Princeton University
US Patent
LigandPNGBDBM285663(US10077273, Compound 11 | US10584132, Compound 11 ...)
Affinity DataIC50:  1.40nMpH: 7.4Assay Description:For the SHMT1 and SHMT2 in vitro enzymatic assays, the rate of 5,10-methylene tetrahydrofolate formation catalyzed by SHMT1/2 was indirectly evaluate...
Ligand InfoPC cidPC sid
In DepthDetails US Patent
TargetSerine hydroxymethyltransferase, cytosolic(Homo sapiens (Human))
The Trustees Of Princeton University
US Patent
LigandPNGBDBM285663(US10077273, Compound 11 | US10584132, Compound 11 ...)
Affinity DataIC50:  0.400nMpH: 7.4Assay Description:For the SHMT1 and SHMT2 in vitro enzymatic assays, the rate of 5,10-methylene tetrahydrofolate formation catalyzed by SHMT1/2 was indirectly evaluate...
Ligand InfoPC cidPC sid
In DepthDetails US Patent
TargetSerine hydroxymethyltransferase, mitochondrial(Homo sapiens (Human))
The Trustees Of Princeton University
US Patent
LigandPNGBDBM285663(US10077273, Compound 11 | US10584132, Compound 11 ...)
Affinity DataIC50:  0.400nM. Assay description: For the SHMT1 and SHMT2 in vitro enzymatic assays, the rate of 5,10-methylene tetrahydrofolate formation catalyzed by SHMT1/2 was indirectly evaluate...
Ligand InfoPC cidPC sid
In DepthDetails US Patent
TargetSerine hydroxymethyltransferase, cytosolic(Homo sapiens (Human))
The Trustees Of Princeton University
US Patent
LigandPNGBDBM285663(US10077273, Compound 11 | US10584132, Compound 11 ...)
Affinity DataIC50:  0.400nM
Ligand InfoPC cidPC sid
In DepthDetails US Patent
TargetSerine hydroxymethyltransferase, cytosolic(Homo sapiens (Human))
The Trustees Of Princeton University
US Patent
LigandPNGBDBM285663(US10077273, Compound 11 | US10584132, Compound 11 ...)
Affinity DataIC50:  1.40nM. Assay description: For the SHMT1 and SHMT2 in vitro enzymatic assays, the rate of 5,10-methylene tetrahydrofolate formation catalyzed by SHMT1/2 was indirectly evaluate...
Ligand InfoPC cidPC sid
In DepthDetails US Patent
TargetSerine hydroxymethyltransferase, mitochondrial(Homo sapiens (Human))
The Trustees Of Princeton University
US Patent
LigandPNGBDBM285663(US10077273, Compound 11 | US10584132, Compound 11 ...)
Affinity DataIC50:  1.40nM. Assay description: Inhibition of human SHMT by compounds in this disclosure is evaluated, for example, in their racemic forms in an in vitro assay. For example, Compoun...
Ligand InfoPC cidPC sid
In DepthDetails US Patent