BDBM28568 N-({3-[12-methyl-8-(methylamino)-5-thia-3,7,10,12-tetraazatricyclo[7.3.0.0^{2,6}]dodeca-1(9),2(6),3,7,10-pentaen-4-yl]phenyl}methyl)acetamide::thiazole-based tricyclic inhibitor, 36a
SMILES CNc1nc2sc(nc2c2n(C)cnc12)-c1cccc(CNC(C)=O)c1
InChI Key InChIKey=JBRXERAIDOFGSA-UHFFFAOYSA-N
Data  5 IC50
  Tab Delimited (TSV)   2D SDfile   Computed 3D by Vconf -m prep SDfile
Find this compound or compounds like it in BindingDB:
Activity Spreadsheet -- Enzyme Inhibition Constant Data from BindingDB
Found 5 hits for monomerid = 28568
TargetInhibitor of nuclear factor kappa-B kinase subunit beta(Homo sapiens (Human))
Bristol-Myers Squibb
LigandPNGBDBM28568(N-({3-[12-methyl-8-(methylamino)-5-thia-3,7,10,12-...)
Affinity DataIC50:  22nMpH: 7.5 T: 2°C. Assay description: Assays measuring the enzyme catalyzed phosphorylation of GST-I-kappa-B-alpha were performed by adding enzyme at room temperature to substrate solutio...
In DepthDetails ArticlePubMed
TargetInhibitor of nuclear factor kappa-B kinase subunit alpha(Homo sapiens (Human))
Bristol-Myers Squibb
LigandPNGBDBM28568(N-({3-[12-methyl-8-(methylamino)-5-thia-3,7,10,12-...)
Affinity DataIC50:  1.90E+3nMT: 2°C. Assay description: Assays measuring the enzyme catalyzed phosphorylation of GST-I-kappa-B-alpha were performed by adding enzyme at room temperature to substrate solutio...
In DepthDetails ArticlePubMed
TargetInhibitor of nuclear factor kappa-B kinase subunit beta(Homo sapiens (Human))
Bristol-Myers Squibb
LigandPNGBDBM28568(N-({3-[12-methyl-8-(methylamino)-5-thia-3,7,10,12-...)
Affinity DataIC50:  22nM. Assay description: Inhibition of human IKKbeta using GST-IkappaBalpha as substrate
In DepthDetails ArticlePubMed
TargetInhibitor of nuclear factor kappa-B kinase subunit beta(Homo sapiens (Human))
Bristol-Myers Squibb
LigandPNGBDBM28568(N-({3-[12-methyl-8-(methylamino)-5-thia-3,7,10,12-...)
Affinity DataIC50:  22nM. Assay description: Inhibition of IKK2
In DepthDetails ArticlePubMed
TargetInhibitor of nuclear factor kappa-B kinase subunit alpha(Homo sapiens (Human))
Bristol-Myers Squibb
LigandPNGBDBM28568(N-({3-[12-methyl-8-(methylamino)-5-thia-3,7,10,12-...)
Affinity DataIC50:  1.90E+3nM. Assay description: Inhibition of IKK1
In DepthDetails ArticlePubMed