BDBM285687 US10077273, Compound HK-X1::US10934305, Compound HK-X1
SMILES CC(C)C1(c2c(C)n[nH]c2OC(N)=C1C#N)c1cc(cc(c1)C(F)(F)F)N1CCCC1
InChI Key
Data  4 IC50
PDB links: 1 PDB ID matches this monomer.
  Tab Delimited (TSV)   2D SDfile   Computed 3D by Vconf -m prep SDfile
Find this compound or compounds like it in BindingDB:
Activity Spreadsheet -- Enzyme Inhibition Constant Data from BindingDB
Found 4 hits for monomerid = 285687
TargetSerine hydroxymethyltransferase, mitochondrial(Homo sapiens (Human))
The Trustees Of Princeton University
US Patent
LigandPNGBDBM285687(US10077273, Compound HK-X1 | US10934305, Compound ...)
Affinity DataIC50:  66nMpH: 7.4Assay Description:For the SHMT1 and SHMT2 in vitro enzymatic assays, the rate of 5,10-methylene tetrahydrofolate formation catalyzed by SHMT1/2 was indirectly evaluate...
TargetSerine hydroxymethyltransferase, mitochondrial(Homo sapiens (Human))
The Trustees Of Princeton University
US Patent
LigandPNGBDBM285687(US10077273, Compound HK-X1 | US10934305, Compound ...)
Affinity DataIC50:  13nM. Assay description: For the SHMT1 and SHMT2 in vitro enzymatic assays, the rate of 5,10-methylene tetrahydrofolate formation catalyzed by SHMT1/2 was indirectly evaluate...
TargetSerine hydroxymethyltransferase, cytosolic(Homo sapiens (Human))
The Trustees Of Princeton University
US Patent
LigandPNGBDBM285687(US10077273, Compound HK-X1 | US10934305, Compound ...)
Affinity DataIC50:  66nM. Assay description: For the SHMT1 and SHMT2 in vitro enzymatic assays, the rate of 5,10-methylene tetrahydrofolate formation catalyzed by SHMT1/2 was indirectly evaluate...
In DepthDetails US Patent
TargetSerine hydroxymethyltransferase, cytosolic(Homo sapiens (Human))
The Trustees Of Princeton University
US Patent
LigandPNGBDBM285687(US10077273, Compound HK-X1 | US10934305, Compound ...)
Affinity DataIC50:  13nMpH: 7.4Assay Description:For the SHMT1 and SHMT2 in vitro enzymatic assays, the rate of 5,10-methylene tetrahydrofolate formation catalyzed by SHMT1/2 was indirectly evaluate...
In DepthDetails US Patent