BDBM285691 US10080744, Example 1
SMILES CC(C)(C)NS(=O)(=O)c1ccc(cc1C(F)(F)F)-c1sc(nc1CC1CCCCC1)-c1nnc(o1)C(C)(C)O
InChI Key InChIKey=VNACWGQRJHAESG-UHFFFAOYSA-N
Data  1 Kd
  Tab Delimited (TSV)   2D SDfile   Computed 3D by Vconf -m prep SDfile
Find this compound or compounds like it in BindingDB:
Activity Spreadsheet -- Enzyme Inhibition Constant Data from BindingDB
Found 1 hit for monomerid = 285691
TargetNuclear receptor ROR-gamma(Homo sapiens (Human))
Janssen Pharmaceutica
US Patent
LigandPNGBDBM285691(US10080744, Example 1)
Affinity DataKd:  67nM. Assay description: For the RORγt construct used in the ThermoFluor assay, numbering for the nucleotide sequences was based on the reference sequence for human ROR&...
Ligand InfoPC cidPC sid
In DepthDetails US Patent