BDBM285756 US10080744, Example 3/23
SMILES CC[C@H](NS(=O)(=O)c1ccc(-c2sc(nc2CC2CCCCC2)-c2nnc(CC(C)(C)C(O)=O)o2)c2ccncc12)C(F)(F)F
InChI Key InChIKey=JGHVLSPSCXUMNL-QHCPKHFHSA-N
Data  1 IC50  1 Kd
  Tab Delimited (TSV)   2D SDfile   Computed 3D by Vconf -m prep SDfile
Find this compound or compounds like it in BindingDB:
Activity Spreadsheet -- Enzyme Inhibition Constant Data from BindingDB
Found 2 hits for monomerid = 285756
TargetNuclear receptor ROR-gamma(Homo sapiens (Human))
Janssen Pharmaceutica
US Patent
LigandPNGBDBM285756(US10080744, Example 3/23)
Affinity DataIC50:  14nM. Assay description: Cells used in this assay were transiently co-transfected with three different plasmids, one expressing the GAL4-DNA binding domain (DBD)-RORγt f...
Ligand InfoPC cidPC sid
In DepthDetails US Patent
TargetNuclear receptor ROR-gamma(Homo sapiens (Human))
Janssen Pharmaceutica
US Patent
LigandPNGBDBM285756(US10080744, Example 3/23)
Affinity DataKd:  0.0450nM. Assay description: For the RORγt construct used in the ThermoFluor assay, numbering for the nucleotide sequences was based on the reference sequence for human ROR&...
Ligand InfoPC cidPC sid
In DepthDetails US Patent