BDBM285806 US10080744, Example 12/5
SMILES CC[C@H](NS(=O)(=O)c1ccc(-c2sc(nc2CN2CCC(F)(F)[C@@H]2C)-c2noc(CC(C)(C)C(O)=O)n2)c(C(F)F)c1F)C(F)(F)F
InChI Key InChIKey=JAEYFVURKLAJAH-LRDDRELGSA-N
Data  1 IC50  1 Kd
  Tab Delimited (TSV)   2D SDfile   Computed 3D by Vconf -m prep SDfile
Find this compound or compounds like it in BindingDB:
Activity Spreadsheet -- Enzyme Inhibition Constant Data from BindingDB
Found 2 hits for monomerid = 285806
TargetNuclear receptor ROR-gamma(Homo sapiens (Human))
Janssen Pharmaceutica
US Patent
LigandPNGBDBM285806(US10080744, Example 12/5)
Affinity DataIC50:  26nM. Assay description: Cells used in this assay were transiently co-transfected with three different plasmids, one expressing the GAL4-DNA binding domain (DBD)-RORγt f...
Ligand InfoPC cidPC sid
In DepthDetails US Patent
TargetNuclear receptor ROR-gamma(Homo sapiens (Human))
Janssen Pharmaceutica
US Patent
LigandPNGBDBM285806(US10080744, Example 12/5)
Affinity DataKd:  0.330nM. Assay description: For the RORγt construct used in the ThermoFluor assay, numbering for the nucleotide sequences was based on the reference sequence for human ROR&...
Ligand InfoPC cidPC sid
In DepthDetails US Patent