BDBM285843 (6R,7R,8S)-8-(3-fluoroprop-1-yn-1-yl)-4-azaspiro[2.5]octane-6,7-diol::US10081601, Example 25::US9796680, Example 25
SMILES O[C@@H]1CNC2(CC2)[C@H](C#CCF)[C@H]1O
InChI Key InChIKey=VGBGTBVAHJMEJG-IWSPIJDZSA-N
Data  2 KI  2 IC50
  Tab Delimited (TSV)   2D SDfile   Computed 3D by Vconf -m prep SDfile
Find this compound or compounds like it in BindingDB:
Activity Spreadsheet -- Enzyme Inhibition Constant Data from BindingDB
Found 4 hits for monomerid = 285843
TargetLysosomal acid glucosylceramidase(Homo sapiens (Human))
Alectos Therapeutics
US Patent
LigandPNGBDBM285843((6R,7R,8S)-8-(3-fluoroprop-1-yn-1-yl)-4-azaspiro[2...)
Affinity DataKi:  15nMpH: 7.0Assay Description:Various concentrations of test compounds were prepared in DMSO and then diluted into buffer consisting of 50 mM sodium phosphate 0.25% w/v sodium tau...
Ligand InfoPC cidPC sid
In DepthDetails US Patent
TargetLysosomal acid glucosylceramidase(Homo sapiens (Human))
Alectos Therapeutics
US Patent
LigandPNGBDBM285843((6R,7R,8S)-8-(3-fluoroprop-1-yn-1-yl)-4-azaspiro[2...)
Affinity DataKi:  15nM. Assay description: Various concentrations of test compounds were prepared in DMSO and then diluted into buffer consisting of 50 mM sodium phosphate 0.25% w/v sodium tau...
Ligand InfoPC cidPC sid
In DepthDetails US Patent
TargetLysosomal acid glucosylceramidase(Homo sapiens (Human))
Alectos Therapeutics
US Patent
LigandPNGBDBM285843((6R,7R,8S)-8-(3-fluoroprop-1-yn-1-yl)-4-azaspiro[2...)
Affinity DataIC50:  16nM. Assay description: Various concentrations of test compounds were prepared in DMSO and then diluted into buffer consisting of 50 mM sodium phosphate 0.25% w/v sodium tau...
Ligand InfoPC cidPC sid
In DepthDetails US Patent
TargetLysosomal acid glucosylceramidase(Homo sapiens (Human))
Alectos Therapeutics
US Patent
LigandPNGBDBM285843((6R,7R,8S)-8-(3-fluoroprop-1-yn-1-yl)-4-azaspiro[2...)
Affinity DataIC50:  16nMpH: 7.0Assay Description:Various concentrations of test compounds were prepared in DMSO and then diluted into buffer consisting of 50 mM sodium phosphate 0.25% w/v sodium tau...
Ligand InfoPC cidPC sid
In DepthDetails US Patent