BDBM285946 4-(4-chloro-2-{3-[5-chloro-2- (1,3-oxazol-5-yl)phenyl]-7- hydroxy-1-oxido-6,7-dihydro- 5H-cyclopenta[b]pyridin-7-yl}- 1H-imidazol-5-yl)-3- fluorothiophene-2-carboxylic acid::US10081617, Example 93::US10081617, Example 94
SMILES OC(=O)c1scc(c1F)-c1[nH]c(nc1Cl)C1(O)CCc2cc(c[n+]([O-])c12)-c1cc(Cl)ccc1-c1cnco1
InChI Key
Data  2 IC50
  Tab Delimited (TSV)   2D SDfile   Computed 3D by Vconf -m prep SDfile
Find this compound or compounds like it in BindingDB:
Activity Spreadsheet -- Enzyme Inhibition Constant Data from BindingDB
Found 2 hits for monomerid = 285946
TargetCoagulation factor XI(Homo sapiens (Human))
Merck Sharp & Dohme
US Patent
LigandPNGBDBM285946(4-(4-chloro-2-{3-[5-chloro-2- (1,3-oxazol-5-yl)phe...)
Affinity DataIC50:  410nMpH: 7.4Assay Description:Factor XIa determinations were made in 50 mM HEPES buffer at pH 7.4 containing 150 mM NaCl, 5 mM CaCl2, and 0.1% PEG 8000 (polyethylene glycol; JT Ba...
Ligand InfoPC cidPC sid
In DepthDetails US Patent
TargetCoagulation factor XI(Homo sapiens (Human))
Merck Sharp & Dohme
US Patent
LigandPNGBDBM285946(4-(4-chloro-2-{3-[5-chloro-2- (1,3-oxazol-5-yl)phe...)
Affinity DataIC50:  210nMpH: 7.4Assay Description:Factor XIa determinations were made in 50 mM HEPES buffer at pH 7.4 containing 150 mM NaCl, 5 mM CaCl2, and 0.1% PEG 8000 (polyethylene glycol; JT Ba...
Ligand InfoPC cidPC sid
In DepthDetails US Patent