BDBM285959 US10081617, Example 106::US10081617, Example 107::methyl [3-chloro-4-(2-{3-[3- chloro-2-fluoro-6-(1H-tetrazol- 1-yl)phenyl]-7-hydroxy-1- oxido-6,7-dihydro-5H- cyclopenta[b]pyridin-7-yl}-1H- imidazol-5-yl)phenyl]carbamate
SMILES COC(=O)Nc1ccc(-c2cnc([nH]2)C2(O)CCc3cc(c[n+]([O-])c23)-c2c(F)c(Cl)ccc2-n2cnnn2)c(Cl)c1
InChI Key
Data  2 IC50
  Tab Delimited (TSV)   2D SDfile   Computed 3D by Vconf -m prep SDfile
Find this compound or compounds like it in BindingDB:
Activity Spreadsheet -- Enzyme Inhibition Constant Data from BindingDB
Found 2 hits for monomerid = 285959
TargetCoagulation factor XI(Homo sapiens (Human))
Merck Sharp & Dohme
US Patent
LigandPNGBDBM285959(US10081617, Example 106 | US10081617, Example 107 ...)
Affinity DataIC50:  45.7nMpH: 7.4Assay Description:Factor XIa determinations were made in 50 mM HEPES buffer at pH 7.4 containing 150 mM NaCl, 5 mM CaCl2, and 0.1% PEG 8000 (polyethylene glycol; JT Ba...
Ligand InfoPC cidPC sid
In DepthDetails US Patent
TargetCoagulation factor XI(Homo sapiens (Human))
Merck Sharp & Dohme
US Patent
LigandPNGBDBM285959(US10081617, Example 106 | US10081617, Example 107 ...)
Affinity DataIC50:  0.340nMpH: 7.4Assay Description:Factor XIa determinations were made in 50 mM HEPES buffer at pH 7.4 containing 150 mM NaCl, 5 mM CaCl2, and 0.1% PEG 8000 (polyethylene glycol; JT Ba...
Ligand InfoPC cidPC sid
In DepthDetails US Patent