BDBM286168 4-(4-(3- (thiophen-2-yl) benzyloxy) bicyclo[2.2.1] heptan-1-yl) butanoic acid::US9518000, Example 61
SMILES OC(=O)CCCC12CCC(CC1)(C2)OCc1cccc(c1)-c1cccs1
InChI Key InChIKey=UHJAIUUJSGEHMK-UHFFFAOYSA-N
Data  1 EC50
  Tab Delimited (TSV)   2D SDfile   Computed 3D by Vconf -m prep SDfile
Find this compound or compounds like it in BindingDB:
Activity Spreadsheet -- Enzyme Inhibition Constant Data from BindingDB
Found 1 hit for monomerid = 286168
TargetFree fatty acid receptor 4(Homo sapiens (Human))
Bristol-Myers Squibb
US Patent
LigandPNGBDBM286168(4-(4-(3- (thiophen-2-yl) benzyloxy) bicyclo[2.2.1]...)
Affinity DataEC50:  750nMT: 2°C. Assay description: The human and mouse GPR120-mediated intracellular phosphorylated ERK assays were established using CHOA12 cells stably transfected with the short for...
Ligand InfoPC cidPC sid
In DepthDetails US Patent