BDBM286207 2-(2-(4-((3-Fluoro-5-phenoxybenzyl)oxy)bicyclo[2.2.1]heptan-1-yl)ethoxy)acetic acid::US9518000, Example 100
SMILES OC(=O)COCCC12CCC(CC1)(C2)OCc1cc(F)cc(Oc2ccccc2)c1
InChI Key InChIKey=DRWSLZWSIURWCG-UHFFFAOYSA-N
Data  1 EC50
  Tab Delimited (TSV)   2D SDfile   Computed 3D by Vconf -m prep SDfile
Find this compound or compounds like it in BindingDB:
Activity Spreadsheet -- Enzyme Inhibition Constant Data from BindingDB
Found 1 hit for monomerid = 286207
TargetFree fatty acid receptor 4(Homo sapiens (Human))
Bristol-Myers Squibb
US Patent
LigandPNGBDBM286207(2-(2-(4-((3-Fluoro-5-phenoxybenzyl)oxy)bicyclo[2.2...)
Affinity DataEC50:  570nMT: 2°C. Assay description: The human and mouse GPR120-mediated intracellular phosphorylated ERK assays were established using CHOA12 cells stably transfected with the short for...
Ligand InfoPC cidPC sid
In DepthDetails US Patent