BDBM286266 N2-ethyl-5-fluoro-N4-{5-[(4-fluoro-1-methylpiperidin-4-yl)carbonyl]-6,6-dimethyl-1,4,5,6-tetrahydropyrrolo[3,4-c]pyrazol-3-yl}pyrimidine-2,4-diamine::US11220518, Ex. No. C1::US11780853, Example C1::US9518060, Example C1
SMILES CCNc1ncc(F)c(Nc2n[nH]c3c2CN(C(=O)C2(F)CCN(C)CC2)C3(C)C)n1
InChI Key InChIKey=UNMSPGLHMOHLGQ-UHFFFAOYSA-N
Data  3 KI
  Tab Delimited (TSV)   2D SDfile   Computed 3D by Vconf -m prep SDfile
Find this compound or compounds like it in BindingDB:
Activity Spreadsheet -- Enzyme Inhibition Constant Data from BindingDB
Found 3 hits for monomerid = 286266
TargetProtein-tyrosine kinase 2-beta(Homo sapiens (Human))
Pfizer
US Patent
LigandPNGBDBM286266(N2-ethyl-5-fluoro-N4-{5-[(4-fluoro-1-methylpiperid...)
Affinity DataKi:  33.4nMpH: 7.4Assay Description:Protein Kinase C beta 2 (PKCβII) catalyzes the production of ADP from ATP that accompanies the phosphoryl transfer to the PKC Pseudosubstrate pe...
Ligand InfoPC cidPC sid
In DepthDetails US Patent
TargetProtein kinase C beta type Isoform 2(Homo sapiens (Human))
Pfizer
US Patent
LigandPNGBDBM286266(N2-ethyl-5-fluoro-N4-{5-[(4-fluoro-1-methylpiperid...)
Affinity DataKi:  33.4nM. Assay description: Protein Kinase C beta 2 (PKCpII) catalyzes the production of ADP from ATP that accompanies the phosphoryl transfer to the PKC Pseudosubstrate peptide...
Ligand InfoPC cidPC sid
In DepthDetails US Patent
TargetProtein kinase C beta type(Homo sapiens (Human))
Pfizer
US Patent
LigandPNGBDBM286266(N2-ethyl-5-fluoro-N4-{5-[(4-fluoro-1-methylpiperid...)
Affinity DataKi:  33.4nM. Assay description: A typical assay was carried out on a 96-well, clear microtiter plate in a Molecular Devices spectrophotometer for 20 minutes at 30° C. in 0.1 mL of a...
Ligand InfoPC cidPC sid
In DepthDetails US Patent