BDBM286327 N-[5-fluoro-2-(methoxymethyl)pyrimidin-4-yl]-6,6-dimethyl-5-{[(2S)-2,4,5,5-tetramethyl piperazin-1-yl]carbonyl}-1,4,5,6-tetrahydropyrrolo[3,4-c]pyrazol-3-amine::US9518060, Example J9
SMILES COCc1ncc(F)c(Nc2c[nH]c3c2CN(C(=O)C2CC(C)(C)N(C)C[C@@H]2C)C3(C)C)n1
InChI Key
Data  1 KI
  Tab Delimited (TSV)   2D SDfile   Computed 3D by Vconf -m prep SDfile
Find this compound or compounds like it in BindingDB:
Activity Spreadsheet -- Enzyme Inhibition Constant Data from BindingDB
Found 1 hit for monomerid = 286327
TargetProtein-tyrosine kinase 2-beta(Homo sapiens (Human))
Pfizer
US Patent
LigandPNGBDBM286327(N-[5-fluoro-2-(methoxymethyl)pyrimidin-4-yl]-6,6-d...)
Affinity DataKi:  2.10nMpH: 7.4Assay Description:Protein Kinase C beta 2 (PKCβII) catalyzes the production of ADP from ATP that accompanies the phosphoryl transfer to the PKC Pseudosubstrate pe...
Ligand InfoPC cidPC sid
In DepthDetails US Patent