BDBM286342 US11220518, Ex. No. J16::US11780853, Example J16::US9518060, Example J16
SMILES C[C@@H]1CN([C@@H](C)CN1CC1CCOCC1)C(=O)N1Cc2c(Nc3nc(C)cc(C)n3)n[nH]c2C1(C)C
InChI Key InChIKey=IETJKSWTKVOWBN-MOPGFXCFSA-N
Data  3 KI
  Tab Delimited (TSV)   2D SDfile   Computed 3D by Vconf -m prep SDfile
Find this compound or compounds like it in BindingDB:
Activity Spreadsheet -- Enzyme Inhibition Constant Data from BindingDB
Found 3 hits for monomerid = 286342
TargetProtein-tyrosine kinase 2-beta(Homo sapiens (Human))
Pfizer
US Patent
LigandPNGBDBM286342(US11220518, Ex. No. J16 | US11780853, Example J16 ...)
Affinity DataKi:  11.1nMpH: 7.4Assay Description:Protein Kinase C beta 2 (PKCβII) catalyzes the production of ADP from ATP that accompanies the phosphoryl transfer to the PKC Pseudosubstrate pe...
Ligand InfoPC cidPC sid
In DepthDetails US Patent
TargetProtein kinase C beta type Isoform 2(Homo sapiens (Human))
Pfizer
US Patent
LigandPNGBDBM286342(US11220518, Ex. No. J16 | US11780853, Example J16 ...)
Affinity DataKi:  11.1nM. Assay description: Protein Kinase C beta 2 (PKCpII) catalyzes the production of ADP from ATP that accompanies the phosphoryl transfer to the PKC Pseudosubstrate peptide...
Ligand InfoPC cidPC sid
In DepthDetails US Patent
TargetProtein kinase C beta type(Homo sapiens (Human))
Pfizer
US Patent
LigandPNGBDBM286342(US11220518, Ex. No. J16 | US11780853, Example J16 ...)
Affinity DataKi:  11.1nM. Assay description: A typical assay was carried out on a 96-well, clear microtiter plate in a Molecular Devices spectrophotometer for 20 minutes at 30° C. in 0.1 mL of a...
Ligand InfoPC cidPC sid
In DepthDetails US Patent