BDBM286408 US9518064, Example 18
SMILES COc1nn2cc(nc2s1)-c1cc2c(OCc3cccc(c3)-c3ccc4OCOc4c3)cc(OC)cc2o1
InChI Key InChIKey=LVCJHIUPGAKASO-UHFFFAOYSA-N
Data  2 IC50
  Tab Delimited (TSV)   2D SDfile   Computed 3D by Vconf -m prep SDfile
Find this compound or compounds like it in BindingDB:
Activity Spreadsheet -- Enzyme Inhibition Constant Data from BindingDB
Found 2 hits for monomerid = 286408
TargetProteinase-activated receptor 1(Homo sapiens (Human))
Bristol-Myers Squibb
US Patent
LigandPNGBDBM286408(US9518064, Example 18)
Affinity DataIC50:  68.2nMT: 2°C. Assay description: The activity of the PAR4 antagonists of the present invention were tested in PAR4 expressing cells by monitoring H-Ala-Phe(4-F)-Pro-Gly-Trp-Leu-Val-L...
Ligand InfoPC cidPC sid
In DepthDetails US Patent
TargetProteinase-activated receptor 4(Homo sapiens (Human))
Bristol-Myers Squibb
US Patent
LigandPNGBDBM286408(US9518064, Example 18)
Affinity DataIC50:  3.5nMT: 2°C. Assay description: The activity of the PAR4 antagonists of the present invention were tested in PAR4 expressing cells by monitoring H-Ala-Phe(4-F)-Pro-Gly-Trp-Leu-Val-L...
Ligand InfoPC cidPC sid
In DepthDetails US Patent