BDBM286702 3-(5-Chloro-2-ethanesulfonyl-benzyl)-7-((R)-3-dimethylamino-pyrrolidin-1-ylmethyl)-6-trifluoromethoxy-1H-quinazoline-2,4-dione::US9567304, Compound C-10
SMILES CCS(=O)(=O)c1ccc(Cl)cc1Cn1c(=O)[nH]c2cc(CN3CC[C@H](C3)N(C)C)c(OC(F)(F)F)cc2c1=O
InChI Key InChIKey=DOBNXLRYOJQLPF-GOSISDBHSA-N
Data  1 IC50
  Tab Delimited (TSV)   2D SDfile   Computed 3D by Vconf -m prep SDfile
Find this compound or compounds like it in BindingDB:
Activity Spreadsheet -- Enzyme Inhibition Constant Data from BindingDB
Found 1 hit for monomerid = 286702
TargetEpithelial discoidin domain-containing receptor 1(Homo sapiens (Human))
Chugai Seiyaku Kabushiki Kaisha
US Patent
LigandPNGBDBM286702(3-(5-Chloro-2-ethanesulfonyl-benzyl)-7-((R)-3-dime...)
Affinity DataIC50:  20nMT: 2°C. Assay description: DDR1 binding activity was measured using the LanthaScreen(Registered trademark) Eu Kinase Binding Assay (manufactured by Life Technologies Corporatio...
Ligand InfoPC cidPC sid
In DepthDetails US Patent