BDBM286996 8-(2-((1-acryloylpiperidin-4-yl)oxy)ethyl)-2-((cyclopropylmethyl)amino)-6-(2,6-dichloro-3,5-dimethoxyphenyl)pyrido[2,3-d]pyrimidin-7(8H)-one::US10294223, Cpd No. 10::US11078199, Cpd 10::US9567334, Example 10::US9815834, Compound 10
SMILES COc1cc(OC)c(Cl)c(c1Cl)-c1cc2cnc(NCC3CC3)nc2n(CCOC2CCN(CC2)C(=O)C=C)c1=O
InChI Key InChIKey=FONDQLCAYMUQPO-UHFFFAOYSA-N
Data  5 IC50
  Tab Delimited (TSV)   2D SDfile   Computed 3D by Vconf -m prep SDfile
Find this compound or compounds like it in BindingDB:
Activity Spreadsheet -- Enzyme Inhibition Constant Data from BindingDB
Found 5 hits for monomerid = 286996
TargetFibroblast growth factor receptor 1(Homo sapiens (Human))
Principia Biopharma
US Patent
LigandPNGBDBM286996(8-(2-((1-acryloylpiperidin-4-yl)oxy)ethyl)-2-((cyc...)
Affinity DataIC50:  1.90nMT: 2°C. Assay description: A Caliper-based kinase assay (Caliper Life Sciences, Hopkinton, Mass.) was used to measure inhibition of FGFR family (FGFR1, FGFR2, FGFR3, FGFR4) kin...
Ligand InfoPC cidPC sid
In DepthDetails US Patent
TargetFibroblast growth factor receptor 1(Homo sapiens (Human))
Principia Biopharma
US Patent
LigandPNGBDBM286996(8-(2-((1-acryloylpiperidin-4-yl)oxy)ethyl)-2-((cyc...)
Affinity DataIC50:  1.90nM. Assay description: A Caliper-based kinase assay (Caliper Life Sciences, Hopkinton, Mass.) was used to measure inhibition of FGFR family (FGFR1, FGFR2, FGFR3, FGFR4) kin...
Ligand InfoPC cidPC sid
In DepthDetails US Patent
TargetFibroblast growth factor receptor 1(Homo sapiens (Human))
Principia Biopharma
US Patent
LigandPNGBDBM286996(8-(2-((1-acryloylpiperidin-4-yl)oxy)ethyl)-2-((cyc...)
Affinity DataIC50:  1.90nM. Assay description: A Caliper-based kinase assay (Caliper Life Sciences, Hopkinton, Mass.) was used to measure inhibition of FGFR family (FGFR1, FGFR2, FGFR3, FGFR4) kin...
Ligand InfoPC cidPC sid
In DepthDetails US Patent
TargetFibroblast growth factor receptor 1(Homo sapiens (Human))
Principia Biopharma
US Patent
LigandPNGBDBM286996(8-(2-((1-acryloylpiperidin-4-yl)oxy)ethyl)-2-((cyc...)
Affinity DataIC50:  16.3nM. Assay description: A Caliper-based kinase assay (Caliper Life Sciences, Hopkinton, Mass.) was used to measure inhibition of FGFR family (FGFR1, FGFR2, FGFR3, FGFR4) kin...
Ligand InfoPC cidPC sid
In DepthDetails US Patent
TargetFibroblast growth factor receptor 2(Homo sapiens (Human))
Principia Biopharma
US Patent
LigandPNGBDBM286996(8-(2-((1-acryloylpiperidin-4-yl)oxy)ethyl)-2-((cyc...)
Affinity DataIC50:  16.3nM. Assay description: The cell-based effects of FGFR inhibitors were determined by measuring inhibition of FGFR-dependent cell line growth. The cell lines SNU-16 was used ...
Ligand InfoPC cidPC sid
In DepthDetails US Patent