BDBM287035 8-(3-(4-acryloylpiperazin-1-yl)propyl)-6-(2,6-dichloro-3,5-dimethoxyphenyl)-2-((3-(2-oxopyrrolidin-1-yl)propyl)amino)pyrido[2,3-d]pyrimidin-7(8H)-one::US10294223, Cpd No. 60::US11078199, Cpd 60::US9567334, Example 60::US9815834, Compound 60
SMILES COc1cc(OC)c(Cl)c(c1Cl)-c1cc2cnc(NCCCN3CCCC3=O)nc2n(CCCN2CCN(CC2)C(=O)C=C)c1=O
InChI Key InChIKey=FXUDALBVHPNJCZ-UHFFFAOYSA-N
Data  5 IC50
  Tab Delimited (TSV)   2D SDfile   Computed 3D by Vconf -m prep SDfile
Find this compound or compounds like it in BindingDB:
Activity Spreadsheet -- Enzyme Inhibition Constant Data from BindingDB
Found 5 hits for monomerid = 287035
TargetFibroblast growth factor receptor 1(Homo sapiens (Human))
Principia Biopharma
US Patent
LigandPNGBDBM287035(8-(3-(4-acryloylpiperazin-1-yl)propyl)-6-(2,6-dich...)
Affinity DataIC50:  2.20nMT: 2°C. Assay description: A Caliper-based kinase assay (Caliper Life Sciences, Hopkinton, Mass.) was used to measure inhibition of FGFR family (FGFR1, FGFR2, FGFR3, FGFR4) kin...
Ligand InfoPC cidPC sid
In DepthDetails US Patent
TargetFibroblast growth factor receptor 1(Homo sapiens (Human))
Principia Biopharma
US Patent
LigandPNGBDBM287035(8-(3-(4-acryloylpiperazin-1-yl)propyl)-6-(2,6-dich...)
Affinity DataIC50:  2.20nM. Assay description: A Caliper-based kinase assay (Caliper Life Sciences, Hopkinton, Mass.) was used to measure inhibition of FGFR family (FGFR1, FGFR2, FGFR3, FGFR4) kin...
Ligand InfoPC cidPC sid
In DepthDetails US Patent
TargetFibroblast growth factor receptor 1(Homo sapiens (Human))
Principia Biopharma
US Patent
LigandPNGBDBM287035(8-(3-(4-acryloylpiperazin-1-yl)propyl)-6-(2,6-dich...)
Affinity DataIC50:  2.20nM. Assay description: A Caliper-based kinase assay (Caliper Life Sciences, Hopkinton, Mass.) was used to measure inhibition of FGFR family (FGFR1, FGFR2, FGFR3, FGFR4) kin...
Ligand InfoPC cidPC sid
In DepthDetails US Patent
TargetFibroblast growth factor receptor 1(Homo sapiens (Human))
Principia Biopharma
US Patent
LigandPNGBDBM287035(8-(3-(4-acryloylpiperazin-1-yl)propyl)-6-(2,6-dich...)
Affinity DataIC50:  8.30nM. Assay description: A Caliper-based kinase assay (Caliper Life Sciences, Hopkinton, Mass.) was used to measure inhibition of FGFR family (FGFR1, FGFR2, FGFR3, FGFR4) kin...
Ligand InfoPC cidPC sid
In DepthDetails US Patent
TargetFibroblast growth factor receptor 2(Homo sapiens (Human))
Principia Biopharma
US Patent
LigandPNGBDBM287035(8-(3-(4-acryloylpiperazin-1-yl)propyl)-6-(2,6-dich...)
Affinity DataIC50:  8.30nM. Assay description: The cell-based effects of FGFR inhibitors were determined by measuring inhibition of FGFR-dependent cell line growth. The cell lines SNU-16 was used ...
Ligand InfoPC cidPC sid
In DepthDetails US Patent