BDBM287197 US9567339, Example A.3.1::US9567339, Example E.8.2
SMILES CC(=O)N1CCC(=CC1)c1cc2c(ccc(C(N)=O)c2[nH]1)-c1cccc(c1C)-n1cnc2ccccc2c1=O
InChI Key InChIKey=SKCMEXAMJWCEBX-UHFFFAOYSA-N
Data  2 IC50
  Tab Delimited (TSV)   2D SDfile   Computed 3D by Vconf -m prep SDfile
Find this compound or compounds like it in BindingDB:
Activity Spreadsheet -- Enzyme Inhibition Constant Data from BindingDB
Found 2 hits for monomerid = 287197
TargetTyrosine-protein kinase BTK [393-659](Homo sapiens (Human))
Abbvie
US Patent
LigandPNGBDBM287197(US9567339, Example A.3.1 | US9567339, Example E.8....)
Affinity DataIC50: <100nMpH: 6.5 T: 2°C. Assay description: The in-house BTK corresponds to recombinant human catalytic domain (aa 393-659), which was expressed in SF9 cells with an N-terminal his tag and puri...
Ligand InfoPC cidPC sid
In DepthDetails US Patent
TargetTyrosine-protein kinase BTK [393-659](Homo sapiens (Human))
Abbvie
US Patent
LigandPNGBDBM287197(US9567339, Example A.3.1 | US9567339, Example E.8....)
Affinity DataIC50: <100nMpH: 6.5 T: 2°C. Assay description: The in-house BTK corresponds to recombinant human catalytic domain (aa 393-659), which was expressed in SF9 cells with an N-terminal his tag and puri...
Ligand InfoPC cidPC sid
In DepthDetails US Patent