BDBM287544 8-(2-((1-acryloylazetidin-3-yl)(isopropyl)amino)ethyl)-6-(2,6-dichloro-3,5-dimethoxyphenyl)-2-(methylamino)pyrido[2,3-d]pyrimidin-7(8H)-one::US10294223, Cpd No. 122::US11078199, Cpd 122::US9567334, Example 122
SMILES CNc1ncc2cc(-c3c(Cl)c(OC)cc(OC)c3Cl)c(=O)n(CCN(C(C)C)C3CN(C3)C(=O)C=C)c2n1
InChI Key InChIKey=POEMCIVMZTZAFH-UHFFFAOYSA-N
Data  3 IC50
  Tab Delimited (TSV)   2D SDfile   Computed 3D by Vconf -m prep SDfile
Find this compound or compounds like it in BindingDB:
Activity Spreadsheet -- Enzyme Inhibition Constant Data from BindingDB
Found 3 hits for monomerid = 287544
TargetFibroblast growth factor receptor 1(Homo sapiens (Human))
Principia Biopharma
US Patent
LigandPNGBDBM287544(8-(2-((1-acryloylazetidin-3-yl)(isopropyl)amino)et...)
Affinity DataIC50:  2.10nMT: 2°C. Assay description: A Caliper-based kinase assay (Caliper Life Sciences, Hopkinton, Mass.) was used to measure inhibition of FGFR family (FGFR1, FGFR2, FGFR3, FGFR4) kin...
Ligand InfoPC cidPC sid
In DepthDetails US Patent
TargetFibroblast growth factor receptor 1(Homo sapiens (Human))
Principia Biopharma
US Patent
LigandPNGBDBM287544(8-(2-((1-acryloylazetidin-3-yl)(isopropyl)amino)et...)
Affinity DataIC50:  2.10nM. Assay description: A Caliper-based kinase assay (Caliper Life Sciences, Hopkinton, Mass.) was used to measure inhibition of FGFR family (FGFR1, FGFR2, FGFR3, FGFR4) kin...
Ligand InfoPC cidPC sid
In DepthDetails US Patent
TargetFibroblast growth factor receptor 1(Homo sapiens (Human))
Principia Biopharma
US Patent
LigandPNGBDBM287544(8-(2-((1-acryloylazetidin-3-yl)(isopropyl)amino)et...)
Affinity DataIC50:  2.10nM. Assay description: A Caliper-based kinase assay (Caliper Life Sciences, Hopkinton, Mass.) was used to measure inhibition of FGFR family (FGFR1, FGFR2, FGFR3, FGFR4) kin...
Ligand InfoPC cidPC sid
In DepthDetails US Patent