BDBM287557 1-(3-(4-acryloylpiperazin-1-yl)propyl)-3-(2,6-dichloro-3,5-dimethoxyphenyl)-7-((2-methoxyethyl)amino)-1,6-naphthyridin-2(1H)-one::US11078199, Cpd 149::US9567334, Example 149
SMILES COCCNc1cc2n(CCCN3CCN(CC3)C(=O)C=C)c(=O)c(cc2cn1)-c1c(Cl)c(OC)cc(OC)c1Cl
InChI Key InChIKey=XKKLGQWHCFVKHD-UHFFFAOYSA-N
Data  2 IC50
  Tab Delimited (TSV)   2D SDfile   Computed 3D by Vconf -m prep SDfile
Find this compound or compounds like it in BindingDB:
Activity Spreadsheet -- Enzyme Inhibition Constant Data from BindingDB
Found 2 hits for monomerid = 287557
TargetFibroblast growth factor receptor 1(Homo sapiens (Human))
Principia Biopharma
US Patent
LigandPNGBDBM287557(1-(3-(4-acryloylpiperazin-1-yl)propyl)-3-(2,6-dich...)
Affinity DataIC50:  1.60nM. Assay description: A Caliper-based kinase assay (Caliper Life Sciences, Hopkinton, Mass.) was used to measure inhibition of FGFR family (FGFR1, FGFR2, FGFR3, FGFR4) kin...
Ligand InfoPC cidPC sid
In DepthDetails US Patent
TargetFibroblast growth factor receptor 1(Homo sapiens (Human))
Principia Biopharma
US Patent
LigandPNGBDBM287557(1-(3-(4-acryloylpiperazin-1-yl)propyl)-3-(2,6-dich...)
Affinity DataIC50:  1.60nMT: 2°C. Assay description: A Caliper-based kinase assay (Caliper Life Sciences, Hopkinton, Mass.) was used to measure inhibition of FGFR family (FGFR1, FGFR2, FGFR3, FGFR4) kin...
Ligand InfoPC cidPC sid
In DepthDetails US Patent