BDBM287579 US9567324, 19
SMILES Cc1ccoc1C(=O)Nc1cccc(c1)C#Cc1cncc(c1)C(=O)N=S1(=O)CCOCC1
InChI Key InChIKey=SBYVCUCEDUFOGL-UHFFFAOYSA-N
Data  2 IC50
  Tab Delimited (TSV)   2D SDfile   Computed 3D by Vconf -m prep SDfile
Find this compound or compounds like it in BindingDB:
Activity Spreadsheet -- Enzyme Inhibition Constant Data from BindingDB
Found 2 hits for monomerid = 287579
TargetPlatelet-derived growth factor receptor beta(Homo sapiens (Human))
Allergan
US Patent
LigandPNGBDBM287579(US9567324, 19)
Affinity DataIC50:  23nMpH: 7.4Assay Description:Biochemical PDGFRβ kinase assays were performed in 96 well microtiter plates that were coated overnight with 75 μg of poly-Glu-Tyr (4:1) in...
Ligand InfoPC cidPC sid
In DepthDetails US Patent
TargetVascular endothelial growth factor receptor 2(Homo sapiens (Human))
Allergan
US Patent
LigandPNGBDBM287579(US9567324, 19)
Affinity DataIC50:  12nMpH: 7.4Assay Description:Biochemical KDR kinase assays were performed in 96 well microtiter plates that were coated overnight with 75 μg/well of poly-Glu-Tyr (4:1) in 10...
Ligand InfoPC cidPC sid
In DepthDetails US Patent