BDBM287618 N-(2-(4-(dimethylamino)piperidin-1-yl)-4-methoxy-5-(7-(quinolin-3-yl)pyrrolo[1,2-f][1,2,4]triazin-2-ylamino)phenyl)acrylamide::US10085983, Compound J-13
SMILES COc1cc(N2CCC(CC2)N(C)C)c(NC(=O)C=C)cc1Nc1ncc2ccc(-c3cnc4ccccc4c3)n2n1
InChI Key InChIKey=YOUNCWKUFGWLLZ-UHFFFAOYSA-N
Data  2 IC50
  Tab Delimited (TSV)   2D SDfile   Computed 3D by Vconf -m prep SDfile
Find this compound or compounds like it in BindingDB:
Activity Spreadsheet -- Enzyme Inhibition Constant Data from BindingDB
Found 2 hits for monomerid = 287618
TargetEpidermal growth factor receptor(Homo sapiens (Human))
Shanghai Haiyan Pharmaceutical Technology
US Patent
LigandPNGBDBM287618(N-(2-(4-(dimethylamino)piperidin-1-yl)-4-methoxy-5...)
Affinity DataIC50:  21nMT: 2°C. Assay description: All reagents used in the following z′-lyte assay were purchased from Invitrogen.The inhibitory activity on T790M/L858R double mutant EGFR kinas...
Ligand InfoPC cidPC sid
In DepthDetails US Patent
TargetEpidermal growth factor receptor [668-1210,T790M,L858R](Homo sapiens (Human))
Shanghai Haiyan Pharmaceutical Technology
US Patent
LigandPNGBDBM287618(N-(2-(4-(dimethylamino)piperidin-1-yl)-4-methoxy-5...)
Affinity DataIC50:  5nMT: 2°C. Assay description: All reagents used in the following z′-lyte assay were purchased from Invitrogen.The inhibitory activity on T790M/L858R double mutant EGFR kinas...
Ligand InfoPC cidPC sid
In DepthDetails US Patent