BDBM287766 US10085986, Example 11
SMILES Oc1cnc(SCc2cc(F)cc(Cl)c2)[nH]c1=O
InChI Key InChIKey=FKTOWBSPASPPLP-UHFFFAOYSA-N
Data  1 IC50
  Tab Delimited (TSV)   2D SDfile   Computed 3D by Vconf -m prep SDfile
Find this compound or compounds like it in BindingDB:
Activity Spreadsheet -- Enzyme Inhibition Constant Data from BindingDB
Found 1 hit for monomerid = 287766
TargetD-amino-acid oxidase(Homo sapiens (Human))
Takeda Pharmaceutical
US Patent
LigandPNGBDBM287766(US10085986, Example 11)
Affinity DataIC50:  150nMpH: 7.4Assay Description:The functional activity of compounds inhibiting the DAAO enzyme was determined by utilizing the co-product of the catalysis of D-Serine, H2O2 which c...
Ligand InfoPC cidPC sid
In DepthDetails US Patent