BDBM287814 6-[(3,5- difluorotricyclo[3.3.1.1~3,7~] dec-1-yl)carbonyl]-8- morpholin-4-yl-6,11- dihydro-5H-pyrido[2,3- b][1,5]benzodiazepine::US10086000, Example 32::US10508108, Example 32
SMILES FC12CC3CC(F)(C1)CC(C3)(C2)C(=O)N1Cc2cccnc2Nc2ccc(cc12)N1CCOCC1
InChI Key InChIKey=RGFSGIZGUMBUDS-UHFFFAOYSA-N
Data  2 IC50
  Tab Delimited (TSV)   2D SDfile   Computed 3D by Vconf -m prep SDfile
Find this compound or compounds like it in BindingDB:
Activity Spreadsheet -- Enzyme Inhibition Constant Data from BindingDB
Found 2 hits for monomerid = 287814
TargetIsocitrate dehydrogenase [NADP] cytoplasmic [R132H](Homo sapiens (Human))
Merck Sharp & Dohme
US Patent
LigandPNGBDBM287814(6-[(3,5- difluorotricyclo[3.3.1.1~3,7~] dec-1-yl)c...)
Affinity DataIC50:  97nM. Assay description: Each test compound (10 mM stock in DMSO) is diluted in DMSO to make a 10-point, 3-fold dilution series. 125 nL of each dilution or DMSO alone is disp...
Ligand InfoPC cidPC sid
In DepthDetails US Patent
TargetIsocitrate dehydrogenase [NADP] cytoplasmic [R132H](Homo sapiens (Human))
Merck Sharp & Dohme
US Patent
LigandPNGBDBM287814(6-[(3,5- difluorotricyclo[3.3.1.1~3,7~] dec-1-yl)c...)
Affinity DataIC50:  97nMpH: 7.0 T: 2°C. Assay description: Each test compound (10 mM stock in DMSO) is diluted in DMSO to make a 10-point, 3-fold dilution series. 125 nL of each dilution or DMSO alone is disp...
Ligand InfoPC cidPC sid
In DepthDetails US Patent