BDBM287817 8-morpholin-4-yl-6- [(3aR,5S,7aR)-octahydro- 1-benzofuran-5- ylcarbonyl]-6,11-dihydro- 5H-pyrido[2,3-b] [1,5]benzodiazepine::US10086000, Example 35::US10508108, Example 35
SMILES O=C([C@@H]1CC[C@H]2OCC[C@H]2C1)N1Cc2cccnc2Nc2ccc(cc12)N1CCOCC1
InChI Key InChIKey=WAPAMYWWIBYLFJ-YZZKKUAISA-N
Data  2 IC50
  Tab Delimited (TSV)   2D SDfile   Computed 3D by Vconf -m prep SDfile
Find this compound or compounds like it in BindingDB:
Activity Spreadsheet -- Enzyme Inhibition Constant Data from BindingDB
Found 2 hits for monomerid = 287817
TargetIsocitrate dehydrogenase [NADP] cytoplasmic [R132H](Homo sapiens (Human))
Merck Sharp & Dohme
US Patent
LigandPNGBDBM287817(8-morpholin-4-yl-6- [(3aR,5S,7aR)-octahydro- 1-ben...)
Affinity DataIC50:  9.48E+3nM. Assay description: Each test compound (10 mM stock in DMSO) is diluted in DMSO to make a 10-point, 3-fold dilution series. 125 nL of each dilution or DMSO alone is disp...
Ligand InfoPC cidPC sid
In DepthDetails US Patent
TargetIsocitrate dehydrogenase [NADP] cytoplasmic [R132H](Homo sapiens (Human))
Merck Sharp & Dohme
US Patent
LigandPNGBDBM287817(8-morpholin-4-yl-6- [(3aR,5S,7aR)-octahydro- 1-ben...)
Affinity DataIC50:  9.48E+3nMpH: 7.0 T: 2°C. Assay description: Each test compound (10 mM stock in DMSO) is diluted in DMSO to make a 10-point, 3-fold dilution series. 125 nL of each dilution or DMSO alone is disp...
Ligand InfoPC cidPC sid
In DepthDetails US Patent