BDBM287887 8-(5-Ethoxypyridin-3-yl)-6-(6,7,8,9-tetrahydro-5H-benzo[7]annulen-7-ylcarbonyl)-6,11-dihydro-5H-pyrido [2,3-b][1,5]benzodiazepine::US10086000, Example 104::US10508108, Example 104
SMILES CCOc1cncc(c1)-c1ccc2Nc3ncccc3CN(C(=O)C3CCc4ccccc4CC3)c2c1
InChI Key InChIKey=FHPNBCQTPCLRAU-UHFFFAOYSA-N
Data  2 IC50
  Tab Delimited (TSV)   2D SDfile   Computed 3D by Vconf -m prep SDfile
Find this compound or compounds like it in BindingDB:
Activity Spreadsheet -- Enzyme Inhibition Constant Data from BindingDB
Found 2 hits for monomerid = 287887
TargetIsocitrate dehydrogenase [NADP] cytoplasmic [R132H](Homo sapiens (Human))
Merck Sharp & Dohme
US Patent
LigandPNGBDBM287887(8-(5-Ethoxypyridin-3-yl)-6-(6,7,8,9-tetrahydro-5H-...)
Affinity DataIC50:  5nM. Assay description: Each test compound (10 mM stock in DMSO) is diluted in DMSO to make a 10-point, 3-fold dilution series. 125 nL of each dilution or DMSO alone is disp...
Ligand InfoPC cidPC sid
In DepthDetails US Patent
TargetIsocitrate dehydrogenase [NADP] cytoplasmic [R132H](Homo sapiens (Human))
Merck Sharp & Dohme
US Patent
LigandPNGBDBM287887(8-(5-Ethoxypyridin-3-yl)-6-(6,7,8,9-tetrahydro-5H-...)
Affinity DataIC50:  5nMpH: 7.0 T: 2°C. Assay description: Each test compound (10 mM stock in DMSO) is diluted in DMSO to make a 10-point, 3-fold dilution series. 125 nL of each dilution or DMSO alone is disp...
Ligand InfoPC cidPC sid
In DepthDetails US Patent