BDBM287906 2-Methyl-6-[(8-morpholin-4-yl-5,11-dihydro-6H-pyrido[2,3-b][1,5]benzodiazepin-6-yl)carbonyl]spiro[3.3]heptan-2-ol::US10086000, Example 123::US10508108, Example 123
SMILES CC1(O)CC2(CC(C2)C(=O)N2Cc3cccnc3Nc3ccc(cc23)N2CCOCC2)C1
InChI Key InChIKey=MOVMEFYRHAUKOW-UHFFFAOYSA-N
Data  2 IC50
  Tab Delimited (TSV)   2D SDfile   Computed 3D by Vconf -m prep SDfile
Find this compound or compounds like it in BindingDB:
Activity Spreadsheet -- Enzyme Inhibition Constant Data from BindingDB
Found 2 hits for monomerid = 287906
TargetIsocitrate dehydrogenase [NADP] cytoplasmic [R132H](Homo sapiens (Human))
Merck Sharp & Dohme
US Patent
LigandPNGBDBM287906(2-Methyl-6-[(8-morpholin-4-yl-5,11-dihydro-6H-pyri...)
Affinity DataIC50:  5.96E+3nM. Assay description: Each test compound (10 mM stock in DMSO) is diluted in DMSO to make a 10-point, 3-fold dilution series. 125 nL of each dilution or DMSO alone is disp...
Ligand InfoPC cidPC sid
In DepthDetails US Patent
TargetIsocitrate dehydrogenase [NADP] cytoplasmic [R132H](Homo sapiens (Human))
Merck Sharp & Dohme
US Patent
LigandPNGBDBM287906(2-Methyl-6-[(8-morpholin-4-yl-5,11-dihydro-6H-pyri...)
Affinity DataIC50:  5.96E+3nMpH: 7.0 T: 2°C. Assay description: Each test compound (10 mM stock in DMSO) is diluted in DMSO to make a 10-point, 3-fold dilution series. 125 nL of each dilution or DMSO alone is disp...
Ligand InfoPC cidPC sid
In DepthDetails US Patent