BDBM287919 US10087144, Compound 119
SMILES CC(C)C(NC(=O)c1cn(Cc2ccccc2)c2ccc(Br)cc2c1=O)C(O)=O
InChI Key InChIKey=IGIVYVCNQIAVOW-UHFFFAOYSA-N
Data  1 EC50
  Tab Delimited (TSV)   2D SDfile   Computed 3D by Vconf -m prep SDfile
Find this compound or compounds like it in BindingDB:
Activity Spreadsheet -- Enzyme Inhibition Constant Data from BindingDB
Found 1 hit for monomerid = 287919
TargetAtrial natriuretic peptide receptor 3(Mus musculus)
Ucl Business
US Patent
LigandPNGBDBM287919(US10087144, Compound 119)
Affinity DataEC50: >5.00E+4nM. Assay description: Male rats (Sprague-Dawley; 200-250 g) were stunned and killed by cervical dislocation. The mesentery was removed and third-order arteries mounted in ...
Ligand InfoPC cidPC sid
In DepthDetails US Patent