BDBM288100 N-(3-chloro-2-fluorobenzyl)- 2'-ethyl-9'-hydroxy-cis-3- (hydroxymethyl)-1',8'-dioxo- 1',2',4',8'- tetrahydrospiro[cyclobutane- 1,3'-pyrido[1,2-a]pyrazine]- 7'-carboxamide hydrochloride::US10087178, Example S60
SMILES CCN1C(=O)c2c(O)c(=O)c(cn2C[C@]11C[C@H](CO)C1)C(=O)NCc1cccc(Cl)c1F
InChI Key InChIKey=UQOBXUPQEWBAFI-LMRGUYSOSA-N
Data  1 EC50
  Tab Delimited (TSV)   2D SDfile   Computed 3D by Vconf -m prep SDfile
Find this compound or compounds like it in BindingDB:
Activity Spreadsheet -- Enzyme Inhibition Constant Data from BindingDB
Found 1 hit for monomerid = 288100
TargetProtein Nef(Human immunodeficiency virus type 1 (isolate BRU/L...)
Japan Tobacco
US Patent
LigandPNGBDBM288100(N-(3-chloro-2-fluorobenzyl)- 2'-ethyl-9'-hydroxy-c...)
Affinity DataEC50:  13nMT: 2°C. Assay description: The medium (40 μL), a test substance (10 μL) diluted with the medium, and a 1×105 cells/mL MT-4 cell suspension (50 μL) wherein HIV-1 ...
Ligand InfoPC cidPC sid
In DepthDetails US Patent