BDBM288242 6-(4-Fluorophenyl)-2-methyl-5-(7-methyl-1H-indazol-5-yl)-::US10087185, Example 60
SMILES Cc1nc2ccc(-c3ccc(F)cc3)c(-c3cc(C)c4[nH]ncc4c3)n2n1
InChI Key InChIKey=UNLXGFOAILUWLL-UHFFFAOYSA-N
Data  1 IC50
  Tab Delimited (TSV)   2D SDfile   Computed 3D by Vconf -m prep SDfile
Find this compound or compounds like it in BindingDB:
Activity Spreadsheet -- Enzyme Inhibition Constant Data from BindingDB
Found 1 hit for monomerid = 288242
TargetVoltage-dependent calcium channel gamma-8 subunit(Homo sapiens (Human))
Janssen Pharmaceutica
US Patent
LigandPNGBDBM288242(6-(4-Fluorophenyl)-2-methyl-5-(7-methyl-1H-indazol...)
Affinity DataIC50:  1.26nMpH: 7.4Assay Description:This assay was used to test compounds for their ability to inhibit TARP γ8 dependent AMPA receptor activity. The AMPA receptor is a non-selectiv...
Ligand InfoPC cidPC sid
In DepthDetails US Patent