BDBM288298 5-(7-Chloro-1H-indazol-5-yl)-2,8-dimethyl-6-(trifluoromethyl)-::US10087185, Example 116
SMILES Cc1nc2c(C)cc(c(-c3cc(Cl)c4[nH]ncc4c3)n2n1)C(F)(F)F
InChI Key InChIKey=KGHDVLCLQWBOBX-UHFFFAOYSA-N
Data  1 IC50
  Tab Delimited (TSV)   2D SDfile   Computed 3D by Vconf -m prep SDfile
Find this compound or compounds like it in BindingDB:
Activity Spreadsheet -- Enzyme Inhibition Constant Data from BindingDB
Found 1 hit for monomerid = 288298
TargetVoltage-dependent calcium channel gamma-8 subunit(Homo sapiens (Human))
Janssen Pharmaceutica
US Patent
LigandPNGBDBM288298(5-(7-Chloro-1H-indazol-5-yl)-2,8-dimethyl-6-(trifl...)
Affinity DataIC50:  2.51nMpH: 7.4Assay Description:This assay was used to test compounds for their ability to inhibit TARP γ8 dependent AMPA receptor activity. The AMPA receptor is a non-selectiv...
Ligand InfoPC cidPC sid
In DepthDetails US Patent