BDBM288376 US10087187, Compound 67
SMILES Cc1c(Cl)cccc1Nc1c(CO)nc2c(cc(nn12)N1CCOCC1)-c1c[nH]cn1
InChI Key InChIKey=KQBSAIIJDNHPSO-UHFFFAOYSA-N
Data  5 Kd
  Tab Delimited (TSV)   2D SDfile   Computed 3D by Vconf -m prep SDfile
Find this compound or compounds like it in BindingDB:
Activity Spreadsheet -- Enzyme Inhibition Constant Data from BindingDB
Found 5 hits for monomerid = 288376
TargetPhosphatidylinositol 4-phosphate 3-kinase C2 domain-containing subunit alpha(Homo sapiens (Human))
Janssen Pharmaceutica
US Patent
LigandPNGBDBM288376(US10087187, Compound 67)
Affinity DataKd:  195nM. Assay description: Kinase enzyme binding affinities of compounds disclosed herein were determined using the KINOMEscan technology performed by DiscoveRx Corporation, Sa...
Ligand InfoPC cidPC sid
In DepthDetails US Patent
TargetPhosphatidylinositol 4-phosphate 3-kinase C2 domain-containing subunit beta(Homo sapiens (Human))
Janssen Pharmaceutica
US Patent
LigandPNGBDBM288376(US10087187, Compound 67)
Affinity DataKd:  0.5nM. Assay description: Kinase enzyme binding affinities of compounds disclosed herein were determined using the KINOMEscan technology performed by DiscoveRx Corporation, Sa...
Ligand InfoPC cidPC sid
In DepthDetails US Patent
TargetSerine/threonine-protein kinase mTOR(Homo sapiens (Human))
Janssen Pharmaceutica
US Patent
LigandPNGBDBM288376(US10087187, Compound 67)
Affinity DataKd:  186nM. Assay description: Kinase enzyme binding affinities of compounds disclosed herein were determined using the KINOMEscan technology performed by DiscoveRx Corporation, Sa...
Ligand InfoPC cidPC sid
In DepthDetails US Patent
TargetPhosphatidylinositol 4,5-bisphosphate 3-kinase catalytic subunit gamma isoform(Homo sapiens (Human))
Janssen Pharmaceutica
US Patent
LigandPNGBDBM288376(US10087187, Compound 67)
Affinity DataKd:  324nM. Assay description: Kinase enzyme binding affinities of compounds disclosed herein were determined using the KINOMEscan technology performed by DiscoveRx Corporation, Sa...
Ligand InfoPC cidPC sid
In DepthDetails US Patent
TargetPhosphatidylinositol 4,5-bisphosphate 3-kinase catalytic subunit delta isoform(Homo sapiens (Human))
Janssen Pharmaceutica
US Patent
LigandPNGBDBM288376(US10087187, Compound 67)
Affinity DataKd:  17nM. Assay description: Kinase enzyme binding affinities of compounds disclosed herein were determined using the KINOMEscan technology performed by DiscoveRx Corporation, Sa...
Ligand InfoPC cidPC sid
In DepthDetails US Patent