BDBM288627 (E)-3-(3,5-difluoro-4-((1S,3R/1R,3S)-2-(2-fluoro-2-methylpropyl)-3-methyl-6-(((S)-tetrahydrofuran-3-yl)oxy)-1,2,3,4-tetrahydroisoquinolin-1-yl)phenyl)acrylic acid::US10087191, Example 37
SMILES CC1Cc2cc(O[C@H]3CCOC3)ccc2C(N1CC(C)(C)F)c1c(F)cc(\C=C\C(O)=O)cc1F
InChI Key InChIKey=JRRMLNIGBQFRKQ-XAQRXUTOSA-N
Data  1 IC50
  Tab Delimited (TSV)   2D SDfile   Computed 3D by Vconf -m prep SDfile
Find this compound or compounds like it in BindingDB:
Activity Spreadsheet -- Enzyme Inhibition Constant Data from BindingDB
Found 1 hit for monomerid = 288627
TargetG-protein coupled estrogen receptor 1(Homo sapiens (Human))
Jiangsu Hengrui Medicine
US Patent
LigandPNGBDBM288627((E)-3-(3,5-difluoro-4-((1S,3R/1R,3S)-2-(2-fluoro-2...)
Affinity DataIC50:  13.7nM. Assay description: The compounds of the present invention have an inhibition effect on the binding of E (estrogen) to ER (estrogen receptor), thereby blocking the bindi...
Ligand InfoPC cidPC sid
In DepthDetails US Patent