BDBM288790 US10092551, Example 98
SMILES O=[#6]1-[#7]=[#6](-[#16]\[#6]-1=[#6]-1/c2ccccc2-[#6]-[#6]-c2ccccc-12)-[#7]-1-[#6]-[#6]C2([#6]-[#6]-1)[#8]-[#6]-c1ccccc21
InChI Key InChIKey=IALPJIBQUVIOKS-UHFFFAOYSA-N
Data  1 KI
  Tab Delimited (TSV)   2D SDfile   Computed 3D by Vconf -m prep SDfile
Find this compound or compounds like it in BindingDB:
Activity Spreadsheet -- Enzyme Inhibition Constant Data from BindingDB
Found 1 hit for monomerid = 288790
TargetVasopressin V1a receptor(Homo sapiens (Human))
Hoffmann-La Roche
US Patent
LigandPNGBDBM288790(US10092551, Example 98)
Affinity DataKi:  2.51nM ΔG°:  -11.7kcal/moleT: 2°C. Assay description: The human V1a receptor was cloned by RT-PCR from total human liver RNA. The coding sequence was subcloned in an expression vector after sequencing to...
Ligand InfoPC cidPC sid
In DepthDetails US Patent