BDBM288810 US10092551, Example 118
SMILES O=[#6]1-[#7]=[#6](-[#16]\[#6]-1=[#6](\[#6]-1-[#6]-[#6]-[#6]-[#6]1)-[#6]-1-[#6]-[#6]-[#6]-[#6]-1)-[#7]-1-[#6]-[#6]C2([#6]-[#6]-1)[#8]-[#6]-c1ccccc21
InChI Key InChIKey=VYQKVFSXYVSSKU-UHFFFAOYSA-N
Data  1 KI
  Tab Delimited (TSV)   2D SDfile   Computed 3D by Vconf -m prep SDfile
Find this compound or compounds like it in BindingDB:
Activity Spreadsheet -- Enzyme Inhibition Constant Data from BindingDB
Found 1 hit for monomerid = 288810
TargetVasopressin V1a receptor(Homo sapiens (Human))
Hoffmann-La Roche
US Patent
LigandPNGBDBM288810(US10092551, Example 118)
Affinity DataKi:  25.1nM ΔG°:  -10.4kcal/moleT: 2°C. Assay description: The human V1a receptor was cloned by RT-PCR from total human liver RNA. The coding sequence was subcloned in an expression vector after sequencing to...
Ligand InfoPC cidPC sid
In DepthDetails US Patent