BDBM288848 US10092551, Example 157
SMILES C\C(=C1/SC(=NC1=O)N1CCC2(CC1)OC(=O)c1ccccc21)c1ccccc1
InChI Key InChIKey=QPLKQFHGVPTCHJ-XDJHFCHBSA-N
Data  1 KI
  Tab Delimited (TSV)   2D SDfile   Computed 3D by Vconf -m prep SDfile
Find this compound or compounds like it in BindingDB:
Activity Spreadsheet -- Enzyme Inhibition Constant Data from BindingDB
Found 1 hit for monomerid = 288848
TargetVasopressin V1a receptor(Homo sapiens (Human))
Hoffmann-La Roche
US Patent
LigandPNGBDBM288848(US10092551, Example 157)
Affinity DataKi:  15.8nM ΔG°:  -10.6kcal/moleT: 2°C. Assay description: The human V1a receptor was cloned by RT-PCR from total human liver RNA. The coding sequence was subcloned in an expression vector after sequencing to...
Ligand InfoPC cidPC sid
In DepthDetails US Patent