BDBM28889 2-[(5Z)-5-{[5-(morpholin-4-yl)thiophen-2-yl]methylidene}-4-oxo-2-sulfanylidene-1,3-thiazolidin-3-yl]acetic acid::rhodanine derivative, 48
SMILES OC(=O)CN1C(=S)S\C(=C/c2ccc(s2)N2CCOCC2)C1=O
InChI Key InChIKey=JLFSPLWIPOIDGX-YFHOEESVSA-N
Data  4 IC50
  Tab Delimited (TSV)   2D SDfile   Computed 3D by Vconf -m prep SDfile
Find this compound or compounds like it in BindingDB:
Activity Spreadsheet -- Enzyme Inhibition Constant Data from BindingDB
Found 4 hits for monomerid = 28889
TargetLethal factor(Bacillus anthracis)
Burnham Institute For Medical Research
LigandPNGBDBM28889(2-[(5Z)-5-{[5-(morpholin-4-yl)thiophen-2-yl]methyl...)
Affinity DataIC50:  3.25E+4nM. Assay description: The fluorescence peptide cleavage assay was performed in a 96-well plate in which each reaction mixture contained MAPKKide, LF (List Biological Labor...
Ligand InfoPC cidPC sid
In DepthDetails ArticlePubMed
TargetMatrix metalloproteinase-9(Homo sapiens (Human))
Burnham Institute For Medical Research
LigandPNGBDBM28889(2-[(5Z)-5-{[5-(morpholin-4-yl)thiophen-2-yl]methyl...)
Affinity DataIC50:  6.49E+4nM. Assay description: This assay was performed as outlined in the Anaspec MMP assay kit. The fluorescence peptide cleavage assay was performed in a 96-well plate in which ...
Ligand InfoPC cidPC sid
In DepthDetails ArticlePubMed
Target72 kDa type IV collagenase(Homo sapiens (Human))
Burnham Institute For Medical Research
LigandPNGBDBM28889(2-[(5Z)-5-{[5-(morpholin-4-yl)thiophen-2-yl]methyl...)
Affinity DataIC50:  4.71E+4nM. Assay description: This assay was performed as outlined in the Anaspec MMP assay kit. The fluorescence peptide cleavage assay was performed in a 96-well plate in which ...
Ligand InfoPC cidPC sid
In DepthDetails ArticlePubMed
TargetBotulinum neurotoxin type A2 [1-425](Clostridium botulinum)
Burnham Institute For Medical Research
LigandPNGBDBM28889(2-[(5Z)-5-{[5-(morpholin-4-yl)thiophen-2-yl]methyl...)
Affinity DataIC50:  1.12E+5nM. Assay description: The fluorescence peptide cleavage assay was performed in a 96-well plates in which each reaction mixture contained SNAPtide, BoNT /A (List Biological...
Ligand InfoPC cidPC sid
In DepthDetails ArticlePubMed