BDBM288998 US10092563, Compound 136
SMILES C[C@H](Nc1nc(N)nc(N)c1C#N)c1nc2cccc(Cl)c2c(=O)n1[C@H]1CCOC1
InChI Key InChIKey=ZNGWESKIDDBWRO-UWVGGRQHSA-N
Data  3 IC50
  Tab Delimited (TSV)   2D SDfile   Computed 3D by Vconf -m prep SDfile
Find this compound or compounds like it in BindingDB:
Activity Spreadsheet -- Enzyme Inhibition Constant Data from BindingDB
Found 3 hits for monomerid = 288998
TargetPhosphatidylinositol 3-kinase regulatory subunit beta(Homo sapiens (Human))
Gilead Sciences
US Patent
LigandPNGBDBM288998(US10092563, Compound 136)
Affinity DataIC50:  1.92E+5nMpH: 7.4Assay Description:TR-FRET monitored the formation of 3,4,5-inositol triphosphate molecule that competed with fluorescently labeled PIPS for binding to the GRP-1 plecks...
Ligand InfoPC cidPC sid
In DepthDetails US Patent
TargetPhosphatidylinositol 4,5-bisphosphate 3-kinase catalytic subunit gamma isoform(Homo sapiens (Human))
Gilead Sciences
US Patent
LigandPNGBDBM288998(US10092563, Compound 136)
Affinity DataIC50:  2.59E+5nMpH: 7.4Assay Description:TR-FRET monitored the formation of 3,4,5-inositol triphosphate molecule that competed with fluorescently labeled PIPS for binding to the GRP-1 plecks...
Ligand InfoPC cidPC sid
In DepthDetails US Patent
TargetPhosphatidylinositol 4,5-bisphosphate 3-kinase catalytic subunit delta isoform(Homo sapiens (Human))
Gilead Sciences
US Patent
LigandPNGBDBM288998(US10092563, Compound 136)
Affinity DataIC50:  2.00E+3nMpH: 7.4Assay Description:TR-FRET monitored the formation of 3,4,5-inositol triphosphate molecule that competed with fluorescently labeled PIPS for binding to the GRP-1 plecks...
Ligand InfoPC cidPC sid
In DepthDetails US Patent