BDBM289076 3-(3-(4-chloro-3,5-dimethylphenoxy)propyl)-7-(2-methoxy-4-methylpyridin-3-yl)-N-(phenylsulfonyl)-1H-indole-2-carboxamide::US10093640, Example 301::US10844032, Example 301
SMILES COc1nccc(C)c1-c1cccc2c(CCCOc3cc(C)c(Cl)c(C)c3)c([nH]c12)C(=O)NS(=O)(=O)c1ccccc1
InChI Key InChIKey=IOCSMPJCGNRXDW-UHFFFAOYSA-N
Data  1 KI  1 IC50
  Tab Delimited (TSV)   2D SDfile   Computed 3D by Vconf -m prep SDfile
Find this compound or compounds like it in BindingDB:
Activity Spreadsheet -- Enzyme Inhibition Constant Data from BindingDB
Found 2 hits for monomerid = 289076
TargetInduced myeloid leukemia cell differentiation protein Mcl-1 [172-327](Homo sapiens (Human))
Vanderbilt University
US Patent
LigandPNGBDBM289076(3-(3-(4-chloro-3,5-dimethylphenoxy)propyl)-7-(2-me...)
Affinity DataKi: <100nM. Assay description: The assay was run using a fluorescein isothiocyanate-labeled BH3 peptide derived from Bak (FITC-AHx-GQVGRQLAIIGDDINR-NH2) that was purchased from Gen...
Ligand InfoPC cidPC sid
In DepthDetails US Patent
TargetInduced myeloid leukemia cell differentiation protein Mcl-1(Homo sapiens (Human))
Novartis
US Patent
LigandPNGBDBM289076(3-(3-(4-chloro-3,5-dimethylphenoxy)propyl)-7-(2-me...)
Affinity DataIC50: <100nMpH: 7.5 T: 2°C. Assay description: Compound affinity was measured using a fluorescence polarization anisotropy competition assay. Anisotropy measurements were carried out in 384-well, ...
Ligand InfoPC cidPC sid
In DepthDetails US Patent