BDBM289091 6-hydroxy-2,4-dioxo-N-(4-sulfamoylphenyl)-1,2,3,4-tetrahydropyrimidine-5-carboxamide::US10093658, Compound Formula (Ia)
SMILES NS(=O)(=O)c1ccc(NC(=O)c2c(O)[nH]c(=O)[nH]c2=O)cc1
InChI Key InChIKey=FYDXLODCNHCNMR-UHFFFAOYSA-N
Data  1 IC50
  Tab Delimited (TSV)   2D SDfile   Computed 3D by Vconf -m prep SDfile
Find this compound or compounds like it in BindingDB:
Activity Spreadsheet -- Enzyme Inhibition Constant Data from BindingDB
Found 1 hit for monomerid = 289091
TargetXanthine dehydrogenase/oxidase(Homo sapiens (Human))
Acquist
US Patent
LigandPNGBDBM289091(6-hydroxy-2,4-dioxo-N-(4-sulfamoylphenyl)-1,2,3,4-...)
Affinity DataIC50: >3.00E+5nM. Assay description: Xanthine oxidase inhibition was determined using a standard fluorescence-based assay for xanthine oxidase activity (McHale A, Grimes H, Coughlan M P:...
Ligand InfoPC cidPC sid
In DepthDetails US Patent