BDBM289096 6-{4-[(3-Chloropyridin-2-yl)oxy]-2-methylphenyl}-5-ethyl-1-methylpyrimidine-2,4(1H,3H)-dione (6)::US10093655, Example 6
SMILES CCc1c(-c2ccc(Oc3ncccc3Cl)cc2C)n(C)c(=O)nc1=O
InChI Key
Data  1 KI
  Tab Delimited (TSV)   2D SDfile   Computed 3D by Vconf -m prep SDfile
Find this compound or compounds like it in BindingDB:
Activity Spreadsheet -- Enzyme Inhibition Constant Data from BindingDB
Found 1 hit for monomerid = 289096
TargetD(1A) dopamine receptor(Homo sapiens (Human))
Pfizer
US Patent
LigandPNGBDBM289096(6-{4-[(3-Chloropyridin-2-yl)oxy]-2-methylphenyl}-5...)
Affinity DataKi:  33.1nMpH: 7.4Assay Description:The affinity of the compounds described herein was determined by competition binding assays similar to those described in Ryman-Rasmussen et al., "Di...
Ligand InfoPC cidPC sid
In DepthDetails US Patent