BDBM289150 US10093660, Example 1.22
SMILES O[C@@H]1COC[C@H]1Oc1cc(F)ccc1Nc1ncnc2cc(cc(Cl)c12)N=S1(=O)CCC1
InChI Key InChIKey=XCQQKYFEUUGRAR-IEBWSBKVSA-N
Data  1 IC50
  Tab Delimited (TSV)   2D SDfile   Computed 3D by Vconf -m prep SDfile
Find this compound or compounds like it in BindingDB:
Activity Spreadsheet -- Enzyme Inhibition Constant Data from BindingDB
Found 1 hit for monomerid = 289150
TargetMAP kinase-interacting serine/threonine-protein kinase 2(Homo sapiens (Human))
Evotec Internatonal
US Patent
LigandPNGBDBM289150(US10093660, Example 1.22)
Affinity DataIC50:  1nMT: 2°C. Assay description: ASSAY SETUP: The inhibition of kinase activity of MNK2a was assessed using pre-activated GST-MNK2a. The white, 384-well OptiPlate F plates were purch...
Ligand InfoPC cidPC sid
In DepthDetails US Patent